newsPSPP - News: PSPP 0.6.0-pre1 now available

 
 
Latest News
PSPP 1.0.1 has been released. posted by blp, Sun 27 Aug 2017 08:02:35 PM UTC - 0 replies
PSPP 1.0.0 has been released. posted by blp, Sun 20 Aug 2017 04:24:22 PM UTC - 0 replies
PSPP 0.11.0 has been released. posted by blp, Sat 12 Aug 2017 06:34:57 PM UTC - 0 replies
PSPP 0.10.2 has been released posted by blp, Sat 23 Jul 2016 05:03:30 PM UTC - 0 replies
PSPP 0.10.1 has been released posted by blp, Sun 03 Apr 2016 03:45:39 AM UTC - 0 replies
[Submit News]
[25 news in archive]

PSPP 0.6.0-pre1 now available

Item posted by Ben Pfaff <blp> on Tue 01 Apr 2008 06:30:32 AM UTC.

The first pre-release of GNU PSPP 0.6.0 is now available on alpha.gnu.org. You can download it at: ftp://alpha.gnu.org/gnu/pspp/pspp-0.6.0-pre1.tar.gz

This pre-release is being made mainly for the purpose of compatibility and portability testing. Please try building and running it and report compatibility problems to bug-gnu-pspp@gnu.org or via the Savannah bug tracking system. With your help, this can be the most portable release of PSPP
yet.

Problem with Ubuntu (posted by Oncle Tom, Sun 20 Apr 2008 11:17:34 AM UTC)

Hello guys,

I tried to make a deb package with your provided file.
./configure and make go well but the make install part fails.

Here is the detailed notice I receive :

{{{
Installing with make install...

========================= Installation results ===========================
make install-recursive
make[1]: entrant dans le répertoire « /home/oncletom/Bureau/pspp-0.4.3 »
Making install in gl
make[2]: entrant dans le répertoire « /home/oncletom/Bureau/pspp-0.4.3/gl »
make install-am
make[3]: entrant dans le répertoire « /home/oncletom/Bureau/pspp-0.4.3/gl »
make[4]: entrant dans le répertoire « /home/oncletom/Bureau/pspp-0.4.3/gl »
test yes != no || /bin/bash /home/oncletom/Bureau/pspp-0.4.3/install-sh -d /usr/local/lib
if test -f /usr/local/lib/charset.alias; then \
sed -f ref-add.sed /usr/local/lib/charset.alias > /usr/local/lib/charset.tmp ; \
/usr/bin/install -c -m 644 /usr/local/lib/charset.tmp /usr/local/lib/charset.alias ; \
rm -f /usr/local/lib/charset.tmp ; \
else \
if test yes = no; then \
sed -f ref-add.sed charset.alias > /usr/local/lib/charset.tmp ; \
/usr/bin/install -c -m 644 /usr/local/lib/charset.tmp /usr/local/lib/charset.alias ; \
rm -f /usr/local/lib/charset.tmp ; \
fi ; \
fi
make[4]: Rien à faire pour « install-data-am ».
make[4]: quittant le répertoire « /home/oncletom/Bureau/pspp-0.4.3/gl »
make[3]: quittant le répertoire « /home/oncletom/Bureau/pspp-0.4.3/gl »
make[2]: quittant le répertoire « /home/oncletom/Bureau/pspp-0.4.3/gl »
Making install in po
make[2]: entrant dans le répertoire « /home/oncletom/Bureau/pspp-0.4.3/po »
/bin/mkdir -p /usr/local/share
/usr/bin/install: initialisation des permissions de `/usr/local/share/locale/de/LC_MESSAGES/pspp.mo': Aucun fichier ou répertoire de ce type
installing de.gmo as /usr/local/share/locale/de/LC_MESSAGES/pspp.mo
/usr/bin/install: initialisation des permissions de `/usr/local/share/locale/en_GB/LC_MESSAGES/pspp.mo': Aucun fichier ou répertoire de ce type
installing en_GB.gmo as /usr/local/share/locale/en_GB/LC_MESSAGES/pspp.mo
if test "pspp" = "gettext-tools"; then \
/bin/mkdir -p /usr/local/share/gettext/po; \
for file in Makefile.in.in remove-potcdate.sin quot.sed boldquot.sed en@quot.header en@boldquot.header insert-header.sin Rules-quot Makevars.template; do \
/usr/bin/install -c -m 644 ./$file \
/usr/local/share/gettext/po/$file; \
done; \
for file in Makevars; do \
rm -f /usr/local/share/gettext/po/$file; \
done; \
else \
: ; \
fi
make[2]: quittant le répertoire « /home/oncletom/Bureau/pspp-0.4.3/po »
make[2]: entrant dans le répertoire « /home/oncletom/Bureau/pspp-0.4.3 »
make[3]: entrant dans le répertoire « /home/oncletom/Bureau/pspp-0.4.3 »
test -z "/usr/local/bin" || /bin/mkdir -p "/usr/local/bin"
/bin/bash ./libtool --mode=install /usr/bin/install -c 'src/ui/terminal/pspp' '/usr/local/bin/pspp'
/usr/bin/install -c src/ui/terminal/pspp /usr/local/bin/pspp
/usr/bin/install: setting permissions for `/usr/local/bin/pspp': No such file or directory
/bin/bash ./libtool --mode=install /usr/bin/install -c 'src/ui/gui/psppire' '/usr/local/bin/psppire'
/usr/bin/install -c src/ui/gui/psppire /usr/local/bin/psppire
/usr/bin/install: setting permissions for `/usr/local/bin/psppire': No such file or directory
test -z "/usr/local/lib/pspp" || /bin/mkdir -p "/usr/local/lib/pspp"
/bin/bash ./libtool --mode=install /usr/bin/install -c 'src/ui/gui/libpsppire.la' '/usr/local/lib/pspp/libpsppire.la'
/usr/bin/install -c src/ui/gui/.libs/libpsppire.so.0.0.0 /usr/local/lib/pspp/libpsppire.so.0.0.0
/usr/bin/install: setting permissions for `/usr/local/lib/pspp/libpsppire.so.0.0.0': No such file or directory
(cd /usr/local/lib/pspp && { ln -s -f libpsppire.so.0.0.0 libpsppire.so.0 || { rm -f libpsppire.so.0 && ln -s libpsppire.so.0.0.0 libpsppire.so.0; }; })
(cd /usr/local/lib/pspp && { ln -s -f libpsppire.so.0.0.0 libpsppire.so || { rm -f libpsppire.so && ln -s libpsppire.so.0.0.0 libpsppire.so; }; })
/usr/bin/install -c src/ui/gui/.libs/libpsppire.lai /usr/local/lib/pspp/libpsppire.la
/usr/bin/install: setting permissions for `/usr/local/lib/pspp/libpsppire.la': No such file or directory
/usr/bin/install -c src/ui/gui/.libs/libpsppire.a /usr/local/lib/pspp/libpsppire.a
/usr/bin/install: setting permissions for `/usr/local/lib/pspp/libpsppire.a': No such file or directory
chmod 644 /usr/local/lib/pspp/libpsppire.a
ranlib /usr/local/lib/pspp/libpsppire.a
ranlib: could not create temporary file whilst writing archive: No more archived files
make[3]: *** [install-pkglibLTLIBRARIES] Erreur 1
make[3]: quittant le répertoire « /home/oncletom/Bureau/pspp-0.4.3 »
make[2]: *** [install-am] Erreur 2
make[2]: quittant le répertoire « /home/oncletom/Bureau/pspp-0.4.3 »
make[1]: *** [install-recursive] Erreur 1
make[1]: quittant le répertoire « /home/oncletom/Bureau/pspp-0.4.3 »
make: *** [install] Erreur 2

        • Installation failed. Aborting package creation.

Cleaning up...OK

Bye.

}}}


readline.c (posted by John Darrington, Tue 01 Apr 2008 10:07:33 AM UTC)

Did you forget to cvs update ?

The recent change to src/ui/terminal/readline.c doesn't seem to be included. Hence I get a build error.


    

 

Back to the top


Powered by Savane 3.1-cleanup1