mainGNU VCDImager - Support: sr #103151, Problem compiling...


sr #103151: Problem compiling...

Submitter:  None
Submitted:  Wed 23 Jun 2004 11:08:28 PM UTC
Category:  Bug Report Priority:  5 - Normal
Severity:  2 - Minor Status:  Done
Privacy:  Public Assigned to:  None
Originator Email:  -email is unavailable- Open/Closed:  Open
Operating System:  None
* Mandatory Fields

Add a New Comment Rich Markup

Sun 12 Sep 2004 01:18:55 AM UTC, comment #3: 

This is a problem in the 0.6.x series. Try using 0.7.20.

Rocky Bernstein <rocky>
Group administrator
Fri 13 Aug 2004 08:22:35 AM UTC, comment #2: 

I tried to run "make" on Red Hat 9 with an older kernel, it is 2.4.20, and I had the same error than you (obviously "configure" didn't report any error)...I don't know what's wrong and moreover there isn't any other source or precompiled release.

The project website ( doesn't work at the moment...

What can we do?


Wed 23 Jun 2004 11:10:46 PM UTC, comment #1: 

I forgot that I've Fedora Core 1 with kernel update to 2.6.2 and KDE 3.2.

Wed 23 Jun 2004 11:08:28 PM UTC, original submission:  

Well, I think that it is a stupid problem, but for me that I am new Linux user it is not.

I tried to compile this program and ./config was ok but after make I received this error:

gcc -DHAVE_CONFIG_H -I. -I. -I..     -g -O2 -Wall -Wunused  -Wall -Wmissing-prototypes -Wunused -Wpointer-arith -Wwrite-strings -c vcd.c
In file included from vcd.c:39:
vcd_files_private.h:364: error: flexible array member in otherwise empty struct
vcd_files_private.h:446: error: flexible array member in otherwise empty struct
vcd_files_private.h:467: error: flexible array member in otherwise empty struct
make[2]: * [vcd.o] Error 1
make[2]: Saliendo directorio `/home/luca/MyDownloads/vcdimager-0.6.2/libvcd'
make[1]: * [all-recursive] Error 1
make[1]: Saliendo directorio `/home/luca/MyDownloads/vcdimager-0.6.2'
make: * [all-recursive-am] Error 2

What should I do?

Thanks, Luca.



(Note: upload size limit is set to 16384 kB, after insertion of the required escape characters.)

Attach Files:

No files currently attached


Depends on the following items: None found

Items that depend on this one: None found


CC list is empty


There are 0 votes so far. Votes easily highlight which items people would like to see resolved in priority, independently of the priority of the item set by tracker managers.

Only logged-in users can vote.


Follows 1 latest change.

Date Changed by Updated Field Previous Value => Replaced by
2004-09-12 rocky StatusNone Done

Back to the top

Powered by Savane 3.13-12ab.
Corresponding source code