bugGNUstep - Bugs: bug #16212, gnuste-gui-svn-22735 compile...

 
 

bug #16212: gnuste-gui-svn-22735 compile error(in Cygwin)

Submitted by:  YunSong Hwang <hys545>
Submitted on:  Wed 29 Mar 2006 11:31:24 AM UTC  
 
Category:  Gui/AppKit Severity:  3 - Normal
Item Group:  Bug Status:  Fixed
Privacy:  Public Assigned to:  Adam Fedor <fedor>
Open/Closed:  Closed

Add a New Comment (Rich Markup)
   

You are not logged in

Please log in, so followups can be emailed to you.

 

Fri 07 Apr 2006 03:24:44 AM UTC, comment #1: 

Fixed. Thanks.

Adam Fedor <fedor>
Project AdministratorIn charge of this item.
Wed 29 Mar 2006 11:31:24 AM UTC, original submission:  

Making all for tool gcloseall...
 Compiling file gcloseall.m ...
`-mcpu=' is deprecated. Use `-mtune=' or '-march=' instead.
gcloseall.m: In function `main':
gcloseall.m:41: error: `NSProcessInfo' undeclared (first use in this function)
gcloseall.m:41: error: (Each undeclared identifier is reported only once
gcloseall.m:41: error: for each function it appears in.)
make[2]: *** [shared_obj/gcloseall.o] Error 1
make[1]: *** [gcloseall.all.tool.variables] Error 2
make[1]: Leaving directory `/home/a/gnustep-gui/Tools'
make: *** [internal-all] Error 2

YunSong Hwang <hys545>

 

(Note: upload size limit is set to 16384 kB, after insertion of the required escape characters.)

Attach Files:
   
   
Comment:
   

No files currently attached

 

Depends on the following items: None found

Items that depend on this one: None found

 

CC list is empty

 

Do you think this task is very important?
If so, you can add your encouragement to it.
This task has 0 encouragements so far.

Only logged-in users can vote.

 

 

 

Follow 3 latest changes.

Date Changed by Updated Field Previous Value => Replaced by
2006-04-07 fedor StatusNone => Fixed
    Assigned toNone => fedor
    Open/ClosedOpen => Closed

Back to the top


Powered by Savane 3.6