bugGnash - The GNU Flash player - Bugs: bug #30226, gnash compile fails on aquasup.h

 
 

bug #30226: gnash compile fails on aquasup.h

Submitted by:  mike mundy <maddog>
Submitted on:  Wed 23 Jun 2010 04:45:14 AM UTC  
 
Category:  None Severity:  3 - Normal
Release:  0.8.7 Status:  In Progress
Privacy:  Public Assigned to:  Markus Gothe <nihilus>
Open/Closed:  Open

Add a New Comment(Rich Markup)
   

You are not logged in

Please log in, so followups can be emailed to you.

 

Wed 23 Jun 2010 04:45:14 AM UTC, original submission:

aquasup.h: At global scope:
aquasup.h:51: error: ISO C++ forbids declaration of ‘EventLoopTimerRef’ with no type
aquasup.h:51: error: expected ‘;’ before ‘*’ token
make[2]: *** [aqua_gnash-gui_aqua.o] Error 1
make[1]: *** [all-recursive] Error 1
make: *** [all] Error 2

mike mundy <maddog>

 

(Note: upload size limit is set to 16384 kB, after insertion of the required escape characters.)

Attach Files:
   
   
Comment:
   

No files currently attached

 

Depends on the following items: None found

Items that depend on this one: None found

 

Carbon-Copy List
  • -email is unavailable- added by nihilus (Updated the item)
  • -email is unavailable- added by rsavoye (Updated the item)
  • -email is unavailable- added by maddog (Submitted the item)
  •  

    Do you think this task is very important?
    If so, you can add your encouragement to it.
    This task has 0 encouragements so far.

    Only logged-in users can vote.

     

    Please enter the title of George Orwell's famous dystopian book (it's a date):

     

     

    Follow 2 latest changes.

    Date Changed by Updated Field Previous Value => Replaced by
    10/23/2010 nihilus StatusNone => In Progress
    06/23/2010 rsavoye Assigned toNone => nihilus

    Back to the top


    Powered by Savane 3.3