bugGNU CSSC - Bugs: bug #29339, cssc 1.2.0 build failure on Mac OS...

 
 

bug #29339: cssc 1.2.0 build failure on Mac OS X

Submitted by:  Ryan Schmidt <ryandesign>
Submitted on:  Fri 26 Mar 2010 01:29:10 AM UTC  
Votes:  1  
 
Category:  None Severity:  3 - Normal
Item Group:  None Status:  None
Privacy:  Public Assigned to:  James Youngman <jay>
Open/Closed:  Closed

Add a New Comment (Rich Markup)
   

You are not logged in

Please log in, so followups can be emailed to you.

 

Sat 11 May 2019 06:51:59 AM UTC, comment #4: 

I'm going to mark this as obsolete since that release is very old now.   If the problem is still relevant to you, could you re-test with CSSC-1.4.1 please?

James Youngman <jay>
Project AdministratorIn charge of this item.
Sun 05 Oct 2014 07:57:09 AM UTC, comment #3: 

Sorry for forgetting this ticket. It can be closed. cssc 1.4.0 is building fine on OS X, with a few patches.

Ryan Schmidt <ryandesign>
Wed 11 May 2011 07:53:15 AM UTC, comment #2: 

Do you still get this failure with CSSC-1.3.1?

James Youngman <jay>
Project AdministratorIn charge of this item.
Thu 06 May 2010 09:16:50 AM UTC, comment #1: 

The current code in the git repository probably fixes this, by removing the explicit template instantiations.   I'll be issuing a release candidate soon.

James Youngman <jay>
Project AdministratorIn charge of this item.
Fri 26 Mar 2010 01:29:10 AM UTC, original submission:  

cssc 1.0.1 builds fine on Mac OS X 10.6.2 Snow Leopard, but 1.2.0 fails like this:

/usr/bin/g++-4.2  -O2 -arch x86_64  -L/opt/local/lib -o get get.o pf-add.o pfile.o sf-chkid.o canonify.o sf-kw.o sf-get.o sf-get2.o writesubst.o sf-get3.o rl-merge.o bodyio.o encoding.o seqstate.o pf-del.o my-getopt.o version.o fdclosed.o showconfig.o environment.o fileiter.o file.o linebuf.o mystring.o sccsname.o sid.o sccsdate.o split.o fnsplit.o quit.o fatalsig.o sccsfile.o rel_list.o sccs-delta.o delta-table.o delta-iterator.o
ld: duplicate symbol mylist<std::basic_string<char, std::char_traits<char>, std::allocator<char> > >::add(std::basic_string<char, std::char_traits<char>, std::allocator<char> > const&)in fileiter.o and get.o
collect2: ld returned 1 exit status
make[2]: *** [get] Error 1
make[1]: *** [all-recursive] Error 1
make: *** [all] Error 2

I also see this problem mentioned here:

http://archives.gentoo.org/gentoo-commits/msg_96a34ec7db7c91f752c5cbdcd9eaf5d4.xml

Ryan Schmidt <ryandesign>

 

(Note: upload size limit is set to 16384 kB, after insertion of the required escape characters.)

Attach Files:
   
   
Comment:
   

No files currently attached

 

Depends on the following items: None found

Items that depend on this one: None found

 

Carbon-Copy List
  • -email is unavailable- added by egallager (Voted in favor of this item)
  • -email is unavailable- added by jay (Posted a comment)
  • -email is unavailable- added by ryandesign (Submitted the item)
  •  

    Do you think this task is very important?
    If so, you can add your encouragement to it.
    This task has 1 encouragement so far.

    Only logged-in users can vote.

     

     

     

    Follow 3 latest changes.

    Date Changed by Updated Field Previous Value => Replaced by
    2019-05-11 jay Open/ClosedOpen => Closed
    2014-10-11 egallager Carbon-Copy- => Added egallager
    2011-05-11 jay Assigned toNone => jay

    Back to the top


    Powered by Savane 3.5