bugGnash - The GNU Flash player - Bugs: bug #50434, Build failure in gnash

 
 

bug #50434: Build failure in gnash

Submitted by:  harish <prak56755>
Submitted on:  Thu 02 Mar 2017 09:33:30 PM UTC  
 
Category:  None Severity:  4 - Important
Release:  None Status:  None
Privacy:  Public Assigned to:  None
Open/Closed:  Open

Add a New Comment (Rich Markup)
   

You are not logged in

Please log in, so followups can be emailed to you.

 

( Jump to the original submission)

Sat 04 Mar 2017 08:03:55 AM UTC, comment #7: 

@nachanon, There hasn't been any change since the original ticket reassignment. You may not have noticed that file at the time but it was there at the original time. It isn't in the most obvious or notable of locations.

Bob Proulx <rwp>
Sat 04 Mar 2017 04:32:29 AM UTC, comment #6: 

@rwp,
Maybe "orphaned" is a more accurate description in this case; since I at the time I wrote comment 3, I didn't see any attachment listed in either this ticket or original ticket (sr #109272).

Anyway, file #39880 is now visibily listed at the bottom of this ticket; so thanks for fixing it (?), and for moving the ticket here.

Nutchanon Wetchasit <nachanon>
Fri 03 Mar 2017 07:04:43 PM UTC, comment #5: 

@nachanon, Scrubbed feels like the wrong description of the behavior to me. It appears to me from looking at what happened that files attached to a ticket are reassigned to the new ticket created when the ticket is reassigned.

Note that the URL for the attached files is a standalone URL not associated with any ticket. The URL of the attachment in the original email is still valid.

There appears to be a database field associating it with a ticket that is moved to the new ticket when the old one is reassigned. Plus since both the original ticket and the new ticket reference each other then everything is chained together.

I can also imagine that the database object associated with the attached file may only have one integer to hold the parent database object id and then it would not be possible to have multiple tickets pointing to the attachment.

Bob Proulx <rwp>
Fri 03 Mar 2017 11:53:36 AM UTC, comment #4: 

Notes for maintainer:

  • The build is a cross compilation.
  • Cross-compilation target is ARMv7 Little-Endian (armv7l) 32-bit.
  • There seems to be two errors...

1. In a file from libstdc++:

In file included from /media/river/backup/factory/rashperry-webbuild/factory-20170221/build_armv7l-timesys-linux-gnueabihf/toolchain/armv7l-timesys-linux-gnueabihf/include/c++/4.9.4/bits/stl_algobase.h:65:0,
                 from /media/river/backup/factory/rashperry-webbuild/factory-20170221/build_armv7l-timesys-linux-gnueabihf/toolchain/armv7l-timesys-linux-gnueabihf/include/c++/4.9.4/list:60,
                 from asobj/flash/display/BitmapData_as.h:24,
                 from asobj/flash/display/BitmapData_as.cpp:21:
/media/river/backup/factory/rashperry-webbuild/factory-20170221/build_armv7l-timesys-linux-gnueabihf/toolchain/armv7l-timesys-linux-gnueabihf/include/c++/4.9.4/bits/stl_iterator_base_types.h: In instantiation of 'struct std::iterator_traits<unsigned int* const>':
/media/river/backup/factory/rashperry-webbuild/factory-20170221/build_armv7l-timesys-linux-gnueabihf/toolchain/include/boost/iterator/iterator_traits.hpp:28:74:   required from 'struct boost::iterators::iterator_reference<unsigned int* const>'
/media/river/backup/factory/rashperry-webbuild/factory-20170221/build_armv7l-timesys-linux-gnueabihf/toolchain/include/boost/iterator/zip_iterator.hpp:90:61:   required from 'struct boost::iterators::detail::dereference_iterator::result<boost::iterators::detail::dereference_iterator(unsigned int* const&)>'
/media/river/backup/factory/rashperry-webbuild/factory-20170221/build_armv7l-timesys-linux-gnueabihf/toolchain/include/boost/utility/result_of.hpp:189:8:   required from 'struct boost::detail::result_of_nested_result<boost::iterators::detail::dereference_iterator, boost::iterators::detail::dereference_iterator(unsigned int* const&)>'
/media/river/backup/factory/rashperry-webbuild/factory-20170221/build_armv7l-timesys-linux-gnueabihf/toolchain/include/boost/utility/result_of.hpp:193:8:   required from 'struct boost::detail::tr1_result_of_impl<boost::iterators::detail::dereference_iterator, boost::iterators::detail::dereference_iterator(unsigned int* const&), false>'
/media/river/backup/factory/rashperry-webbuild/factory-20170221/build_armv7l-timesys-linux-gnueabihf/toolchain/include/boost/utility/detail/result_of_iterate.hpp:27:8:   required from 'struct boost::tr1_result_of<boost::iterators::detail::dereference_iterator(unsigned int* const&)>'
/media/river/backup/factory/rashperry-webbuild/factory-20170221/build_armv7l-timesys-linux-gnueabihf/toolchain/include/boost/utility/detail/result_of_iterate.hpp:159:8:   [ skipping 16 instantiation contexts, use -ftemplate-backtrace-limit=0 to disable ]
/media/river/backup/factory/rashperry-webbuild/factory-20170221/build_armv7l-timesys-linux-gnueabihf/toolchain/armv7l-timesys-linux-gnueabihf/include/c++/4.9.4/bits/stl_algobase.h:398:70:   required from '_OI std::__copy_move_a(_II, _II, _OI) [with bool _IsMove = false; _II = boost::iterators::zip_iterator<boost::tuples::tuple<unsigned int*, boost::array<double, 2u>*, boost::tuples::null_type, boost::tuples::null_type, boost::tuples::null_type, boost::tuples::null_type, boost::tuples::null_type, boost::tuples::null_type, boost::tuples::null_type, boost::tuples::null_type> >; _OI = boost::iterators::zip_iterator<boost::tuples::tuple<unsigned int*, boost::array<double, 2u>*, boost::tuples::null_type, boost::tuples::null_type, boost::tuples::null_type, boost::tuples::null_type, boost::tuples::null_type, boost::tuples::null_type, boost::tuples::null_type, boost::tuples::null_type> >]'
/media/river/backup/factory/rashperry-webbuild/factory-20170221/build_armv7l-timesys-linux-gnueabihf/toolchain/armv7l-timesys-linux-gnueabihf/include/c++/4.9.4/bits/stl_algobase.h:436:38:   required from '_OI std::__copy_move_a2(_II, _II, _OI) [with bool _IsMove = false; _II = boost::iterators::zip_iterator<boost::tuples::tuple<unsigned int*, boost::array<double, 2u>*, boost::tuples::null_type, boost::tuples::null_type, boost::tuples::null_type, boost::tuples::null_type, boost::tuples::null_type, boost::tuples::null_type, boost::tuples::null_type, boost::tuples::null_type> >; _OI = boost::iterators::zip_iterator<boost::tuples::tuple<unsigned int*, boost::array<double, 2u>*, boost::tuples::null_type, boost::tuples::null_type, boost::tuples::null_type, boost::tuples::null_type, boost::tuples::null_type, boost::tuples::null_type, boost::tuples::null_type, boost::tuples::null_type> >]'
/media/river/backup/factory/rashperry-webbuild/factory-20170221/build_armv7l-timesys-linux-gnueabihf/toolchain/armv7l-timesys-linux-gnueabihf/include/c++/4.9.4/bits/stl_algobase.h:468:17:   required from '_OI std::copy(_II, _II, _OI) [with _II = boost::iterators::zip_iterator<boost::tuples::tuple<unsigned int*, boost::array<double, 2u>*, boost::tuples::null_type, boost::tuples::null_type, boost::tuples::null_type, boost::tuples::null_type, boost::tuples::null_type, boost::tuples::null_type, boost::tuples::null_type, boost::tuples::null_type> >; _OI = boost::iterators::zip_iterator<boost::tuples::tuple<unsigned int*, boost::array<double, 2u>*, boost::tuples::null_type, boost::tuples::null_type, boost::tuples::null_type, boost::tuples::null_type, boost::tuples::null_type, boost::tuples::null_type, boost::tuples::null_type, boost::tuples::null_type> >]'
asobj/flash/display/BitmapData_as.cpp:412:73:   required from 'void gnash::{anonymous}::PerlinNoise<T, Size, Offset>::init(int) [with T = double; unsigned int Size = 256u; unsigned int Offset = 1327u]'
asobj/flash/display/BitmapData_as.cpp:310:18:   required from 'gnash::{anonymous}::PerlinNoise<T, Size, Offset>::PerlinNoise(int) [with T = double; unsigned int Size = 256u; unsigned int Offset = 1327u]'
asobj/flash/display/BitmapData_as.cpp:1371:23:   required from here
/media/river/backup/factory/rashperry-webbuild/factory-20170221/build_armv7l-timesys-linux-gnueabihf/toolchain/armv7l-timesys-linux-gnueabihf/include/c++/4.9.4/bits/stl_iterator_base_types.h:165:53: error: 'unsigned int* const' is not a class, struct, or union type
       typedef typename _Iterator::iterator_category iterator_category;
                                                     ^
/media/river/backup/factory/rashperry-webbuild/factory-20170221/build_armv7l-timesys-linux-gnueabihf/toolchain/armv7l-timesys-linux-gnueabihf/include/c++/4.9.4/bits/stl_iterator_base_types.h:166:46: error: 'unsigned int* const' is not a class, struct, or union type
       typedef typename _Iterator::value_type        value_type;
                                              ^
/media/river/backup/factory/rashperry-webbuild/factory-20170221/build_armv7l-timesys-linux-gnueabihf/toolchain/armv7l-timesys-linux-gnueabihf/include/c++/4.9.4/bits/stl_iterator_base_types.h:167:51: error: 'unsigned int* const' is not a class, struct, or union type
       typedef typename _Iterator::difference_type   difference_type;
                                                   ^
/media/river/backup/factory/rashperry-webbuild/factory-20170221/build_armv7l-timesys-linux-gnueabihf/toolchain/armv7l-timesys-linux-gnueabihf/include/c++/4.9.4/bits/stl_iterator_base_types.h:168:43: error: 'unsigned int* const' is not a class, struct, or union type
       typedef typename _Iterator::pointer           pointer;
                                           ^
/media/river/backup/factory/rashperry-webbuild/factory-20170221/build_armv7l-timesys-linux-gnueabihf/toolchain/armv7l-timesys-linux-gnueabihf/include/c++/4.9.4/bits/stl_iterator_base_types.h:169:45: error: 'unsigned int* const' is not a class, struct, or union type
       typedef typename _Iterator::reference         reference;
                                             ^

2. In a file from libboost:

In file included from /media/river/backup/factory/rashperry-webbuild/factory-20170221/build_armv7l-timesys-linux-gnueabihf/toolchain/include/boost/fusion/adapted/boost_tuple/detail/convert_impl.hpp:11:0,
                 from /media/river/backup/factory/rashperry-webbuild/factory-20170221/build_armv7l-timesys-linux-gnueabihf/toolchain/include/boost/fusion/adapted/boost_tuple.hpp:20,
                 from /media/river/backup/factory/rashperry-webbuild/factory-20170221/build_armv7l-timesys-linux-gnueabihf/toolchain/include/boost/iterator/zip_iterator.hpp:21,
                 from asobj/flash/display/BitmapData_as.cpp:28:
/media/river/backup/factory/rashperry-webbuild/factory-20170221/build_armv7l-timesys-linux-gnueabihf/toolchain/include/boost/fusion/adapted/boost_tuple/detail/build_cons.hpp: In instantiation of 'static boost::fusion::detail::build_tuple_cons<First, Last, false>::type boost::fusion::detail::build_tuple_cons<First, Last, false>::call(const First&, const Last&) [with First = boost::fusion::transform_view_iterator<boost::fusion::boost_tuple_iterator<const boost::tuples::tuple<unsigned int*, boost::array<double, 2u>*, boost::tuples::null_type, boost::tuples::null_type, boost::tuples::null_type, boost::tuples::null_type, boost::tuples::null_type, boost::tuples::null_type, boost::tuples::null_type, boost::tuples::null_type> >, boost::iterators::detail::dereference_iterator>; Last = boost::fusion::transform_view_iterator<boost::fusion::boost_tuple_iterator<const boost::tuples::null_type>, boost::iterators::detail::dereference_iterator>; boost::fusion::detail::build_tuple_cons<First, Last, false>::type = boost::tuples::cons<unsigned int&, boost::tuples::cons<boost::array<double, 2u>&, boost::tuples::null_type> >; typename boost::fusion::detail::build_tuple_cons<typename boost::fusion::result_of::next<Iterator>::type, Last>::type = boost::tuples::cons<boost::array<double, 2u>&, boost::tuples::null_type>; typename boost::fusion::result_of::value_of<First>::type = unsigned int&]':
/media/river/backup/factory/rashperry-webbuild/factory-20170221/build_armv7l-timesys-linux-gnueabihf/toolchain/include/boost/fusion/adapted/boost_tuple/detail/convert_impl.hpp:43:87:   required from 'static boost::fusion::extension::convert_impl<boost::fusion::boost_tuple_tag>::apply<Sequence>::type boost::fusion::extension::convert_impl<boost::fusion::boost_tuple_tag>::apply<Sequence>::call(Sequence&) [with Sequence = boost::fusion::transform_view<const boost::tuples::tuple<unsigned int*, boost::array<double, 2u>*, boost::tuples::null_type, boost::tuples::null_type, boost::tuples::null_type, boost::tuples::null_type, boost::tuples::null_type, boost::tuples::null_type, boost::tuples::null_type, boost::tuples::null_type>, boost::iterators::detail::dereference_iterator, boost::fusion::void_>; boost::fusion::extension::convert_impl<boost::fusion::boost_tuple_tag>::apply<Sequence>::type = boost::tuples::cons<unsigned int&, boost::tuples::cons<boost::array<double, 2u>&, boost::tuples::null_type> >]'
/media/river/backup/factory/rashperry-webbuild/factory-20170221/build_armv7l-timesys-linux-gnueabihf/toolchain/include/boost/fusion/sequence/convert.hpp:47:29:   required from 'typename boost::fusion::result_of::convert<Tag, Sequence>::type boost::fusion::convert(Sequence&) [with Tag = boost::fusion::boost_tuple_tag; Sequence = boost::fusion::transform_view<const boost::tuples::tuple<unsigned int*, boost::array<double, 2u>*, boost::tuples::null_type, boost::tuples::null_type, boost::tuples::null_type, boost::tuples::null_type, boost::tuples::null_type, boost::tuples::null_type, boost::tuples::null_type, boost::tuples::null_type>, boost::iterators::detail::dereference_iterator, boost::fusion::void_>; typename boost::fusion::result_of::convert<Tag, Sequence>::type = boost::tuples::cons<unsigned int&, boost::tuples::cons<boost::array<double, 2u>&, boost::tuples::null_type> >]'
/media/river/backup/factory/rashperry-webbuild/factory-20170221/build_armv7l-timesys-linux-gnueabihf/toolchain/include/boost/iterator/zip_iterator.hpp:214:44:   required from 'static reference boost::iterators::detail::converter<reference>::call(Seq) [with Seq = boost::fusion::transform_view<const boost::tuples::tuple<unsigned int*, boost::array<double, 2u>*, boost::tuples::null_type, boost::tuples::null_type, boost::tuples::null_type, boost::tuples::null_type, boost::tuples::null_type, boost::tuples::null_type, boost::tuples::null_type, boost::tuples::null_type>, boost::iterators::detail::dereference_iterator, boost::fusion::void_>; reference = boost::tuples::cons<unsigned int&, boost::tuples::cons<boost::array<double, 2u>&, boost::tuples::null_type> >]'
/media/river/backup/factory/rashperry-webbuild/factory-20170221/build_armv7l-timesys-linux-gnueabihf/toolchain/include/boost/iterator/zip_iterator.hpp:289:42:   required from 'typename boost::iterators::detail::zip_iterator_base<IteratorTuple>::type::reference boost::iterators::zip_iterator<IteratorTuple>::dereference() const [with IteratorTuple = boost::tuples::tuple<unsigned int*, boost::array<double, 2u>*, boost::tuples::null_type, boost::tuples::null_type, boost::tuples::null_type, boost::tuples::null_type, boost::tuples::null_type, boost::tuples::null_type, boost::tuples::null_type, boost::tuples::null_type>; typename boost::iterators::detail::zip_iterator_base<IteratorTuple>::type::reference = boost::tuples::cons<unsigned int&, boost::tuples::cons<boost::array<double, 2u>&, boost::tuples::null_type> >]'
/media/river/backup/factory/rashperry-webbuild/factory-20170221/build_armv7l-timesys-linux-gnueabihf/toolchain/include/boost/iterator/iterator_facade.hpp:549:32:   required from 'static typename Facade::reference boost::iterators::iterator_core_access::dereference(const Facade&) [with Facade = boost::iterators::zip_iterator<boost::tuples::tuple<unsigned int*, boost::array<double, 2u>*, boost::tuples::null_type, boost::tuples::null_type, boost::tuples::null_type, boost::tuples::null_type, boost::tuples::null_type, boost::tuples::null_type, boost::tuples::null_type, boost::tuples::null_type> >; typename Facade::reference = boost::tuples::cons<unsigned int&, boost::tuples::cons<boost::array<double, 2u>&, boost::tuples::null_type> >]'
/media/river/backup/factory/rashperry-webbuild/factory-20170221/build_armv7l-timesys-linux-gnueabihf/toolchain/include/boost/iterator/iterator_facade.hpp:655:69:   [ skipping 2 instantiation contexts, use -ftemplate-backtrace-limit=0 to disable ]
/media/river/backup/factory/rashperry-webbuild/factory-20170221/build_armv7l-timesys-linux-gnueabihf/toolchain/armv7l-timesys-linux-gnueabihf/include/c++/4.9.4/bits/stl_algobase.h:398:70:   required from '_OI std::__copy_move_a(_II, _II, _OI) [with bool _IsMove = false; _II = boost::iterators::zip_iterator<boost::tuples::tuple<unsigned int*, boost::array<double, 2u>*, boost::tuples::null_type, boost::tuples::null_type, boost::tuples::null_type, boost::tuples::null_type, boost::tuples::null_type, boost::tuples::null_type, boost::tuples::null_type, boost::tuples::null_type> >; _OI = boost::iterators::zip_iterator<boost::tuples::tuple<unsigned int*, boost::array<double, 2u>*, boost::tuples::null_type, boost::tuples::null_type, boost::tuples::null_type, boost::tuples::null_type, boost::tuples::null_type, boost::tuples::null_type, boost::tuples::null_type, boost::tuples::null_type> >]'
/media/river/backup/factory/rashperry-webbuild/factory-20170221/build_armv7l-timesys-linux-gnueabihf/toolchain/armv7l-timesys-linux-gnueabihf/include/c++/4.9.4/bits/stl_algobase.h:436:38:   required from '_OI std::__copy_move_a2(_II, _II, _OI) [with bool _IsMove = false; _II = boost::iterators::zip_iterator<boost::tuples::tuple<unsigned int*, boost::array<double, 2u>*, boost::tuples::null_type, boost::tuples::null_type, boost::tuples::null_type, boost::tuples::null_type, boost::tuples::null_type, boost::tuples::null_type, boost::tuples::null_type, boost::tuples::null_type> >; _OI = boost::iterators::zip_iterator<boost::tuples::tuple<unsigned int*, boost::array<double, 2u>*, boost::tuples::null_type, boost::tuples::null_type, boost::tuples::null_type, boost::tuples::null_type, boost::tuples::null_type, boost::tuples::null_type, boost::tuples::null_type, boost::tuples::null_type> >]'
/media/river/backup/factory/rashperry-webbuild/factory-20170221/build_armv7l-timesys-linux-gnueabihf/toolchain/armv7l-timesys-linux-gnueabihf/include/c++/4.9.4/bits/stl_algobase.h:468:17:   required from '_OI std::copy(_II, _II, _OI) [with _II = boost::iterators::zip_iterator<boost::tuples::tuple<unsigned int*, boost::array<double, 2u>*, boost::tuples::null_type, boost::tuples::null_type, boost::tuples::null_type, boost::tuples::null_type, boost::tuples::null_type, boost::tuples::null_type, boost::tuples::null_type, boost::tuples::null_type> >; _OI = boost::iterators::zip_iterator<boost::tuples::tuple<unsigned int*, boost::array<double, 2u>*, boost::tuples::null_type, boost::tuples::null_type, boost::tuples::null_type, boost::tuples::null_type, boost::tuples::null_type, boost::tuples::null_type, boost::tuples::null_type, boost::tuples::null_type> >]'
asobj/flash/display/BitmapData_as.cpp:412:73:   required from 'void gnash::{anonymous}::PerlinNoise<T, Size, Offset>::init(int) [with T = double; unsigned int Size = 256u; unsigned int Offset = 1327u]'
asobj/flash/display/BitmapData_as.cpp:310:18:   required from 'gnash::{anonymous}::PerlinNoise<T, Size, Offset>::PerlinNoise(int) [with T = double; unsigned int Size = 256u; unsigned int Offset = 1327u]'
asobj/flash/display/BitmapData_as.cpp:1371:23:   required from here
/media/river/backup/factory/rashperry-webbuild/factory-20170221/build_armv7l-timesys-linux-gnueabihf/toolchain/include/boost/fusion/adapted/boost_tuple/detail/build_cons.hpp:53:59: error: no match for 'operator*' (operand type is 'const boost::fusion::transform_view_iterator<boost::fusion::boost_tuple_iterator<const boost::tuples::tuple<unsigned int*, boost::array<double, 2u>*, boost::tuples::null_type, boost::tuples::null_type, boost::tuples::null_type, boost::tuples::null_type, boost::tuples::null_type, boost::tuples::null_type, boost::tuples::null_type, boost::tuples::null_type> >, boost::iterators::detail::dereference_iterator>')
             typename result_of::value_of<First>::type v = *f;
                                                           ^
/media/river/backup/factory/rashperry-webbuild/factory-20170221/build_armv7l-timesys-linux-gnueabihf/toolchain/include/boost/fusion/adapted/boost_tuple/detail/build_cons.hpp:53:59: note: candidate is:
In file included from /media/river/backup/factory/rashperry-webbuild/factory-20170221/build_armv7l-timesys-linux-gnueabihf/toolchain/include/boost/fusion/adapted/boost_tuple/detail/build_cons.hpp:14:0,
                 from /media/river/backup/factory/rashperry-webbuild/factory-20170221/build_armv7l-timesys-linux-gnueabihf/toolchain/include/boost/fusion/adapted/boost_tuple/detail/convert_impl.hpp:11,
                 from /media/river/backup/factory/rashperry-webbuild/factory-20170221/build_armv7l-timesys-linux-gnueabihf/toolchain/include/boost/fusion/adapted/boost_tuple.hpp:20,
                 from /media/river/backup/factory/rashperry-webbuild/factory-20170221/build_armv7l-timesys-linux-gnueabihf/toolchain/include/boost/iterator/zip_iterator.hpp:21,
                 from asobj/flash/display/BitmapData_as.cpp:28:
/media/river/backup/factory/rashperry-webbuild/factory-20170221/build_armv7l-timesys-linux-gnueabihf/toolchain/include/boost/fusion/iterator/deref.hpp:69:5: note: template<class Iterator> typename boost::fusion::result_of::deref<Iterator>::type boost::fusion::operator*(const boost::fusion::iterator_base<Derived>&)
     operator*(iterator_base<Iterator> const& i)
     ^
/media/river/backup/factory/rashperry-webbuild/factory-20170221/build_armv7l-timesys-linux-gnueabihf/toolchain/include/boost/fusion/iterator/deref.hpp:69:5: note:   substitution of deduced template arguments resulted in errors seen above

Note: I'm not familiar with ARM (Raspberry Pi?) cross compilation toolchain, so I'll leave this to Gnash maintainers.

Nutchanon Wetchasit <nachanon>
Fri 03 Mar 2017 11:31:53 AM UTC, comment #3: 

The missing error log attachment `build-failure` can be found as file #39880.

@rwp, is the ticket reassignment process designed to scrub attached files from the ticket?

Nutchanon Wetchasit <nachanon>
Thu 02 Mar 2017 09:33:30 PM UTC, comment #2: 

This item has been reassigned from the project Savannah Administration support tracker to your tracker.

The original report is still available at support #109272

Following are the information included in the original report:

[field #0]                  Item ID: 109272
[field #1]                 Group ID: 5802
[field #2]              Open/Closed: Open
[field #3]                 Severity: 4 - Important
[field #4]                  Privacy: Public
[field #8]                         : Unknown support Field Display Type
[field #9]                 Category: Savannah trackers - bugs, tasks, etc.
[field #10]             Submitted by: prak56755
[field #11]              Assigned to: None
[field #12]             Submitted on: Thu 02 Mar 2017 07:15:44 AM MST
[field #13]                  Summary: Build failure in gnash
[field #14]      Original Submission: Could you please help me to sort out the  below issues, I don't know have any idea about the error currently I am getting,

note:   substitution of deduced template arguments resulted in errors seen above
make[5]: *** [BitmapData_as.lo] Error 1
make[5]: *** Waiting for unfinished jobs....

Please find the attached error log below,

The compilation fails when compiling the gnash with boost 1.62.0 version.

Could you please confirm the error relates to gnash or boost library.

Thanks in Advance

Regards
[field #16]               Item Group: None
[field #17]                   Status: None
[field #18]        Component Version: None
[field #19]         Operating System: GNU/Linux
[field #20]          Reproducibility: None
[field #21]               Size (loc): None
[field #22]            Fixed Release: None
[field #23]          Planned Release: None
[field #24]                   Effort: 0.00
[field #28]                 Priority: 5 - Normal
[field #31]         Percent Complete: 0%
[field #33]                  Release: None
[field #36]         Originator Email: prakash56755@gmail.com
[field #58]     Custom Select Box #1: None
[field #59]     Custom Select Box #2: None
[field #60]     Custom Select Box #3: None
[field #61]     Custom Select Box #4: None
[field #62]     Custom Select Box #5: None
[field #63]     Custom Select Box #6: None
[field #64]     Custom Select Box #7: None
[field #65]     Custom Select Box #8: None
[field #66]     Custom Select Box #9: None
[field #67]    Custom Select Box #10: None

Bob Proulx <rwp>
Thu 02 Mar 2017 09:33:09 PM UTC, comment #1: 

I am sorry but you have submitted your bug to the wrong project.  This isn't gnash.  I will attempt to reassign it.

Bob Proulx <rwp>
Thu 02 Mar 2017 09:33:30 PM UTC, original submission:  

Could you please help me to sort out the  below issues, I don't know have any idea about the error currently I am getting,

note:   substitution of deduced template arguments resulted in errors seen above
make[5]: *** [BitmapData_as.lo] Error 1
make[5]: *** Waiting for unfinished jobs....

Please find the attached error log below,

The compilation fails when compiling the gnash with boost 1.62.0 version.

Could you please confirm the error relates to gnash or boost library.

Thanks in Advance

Regards

harish <prak56755>

 

(Note: upload size limit is set to 16384 kB, after insertion of the required escape characters.)

Attach Files:
   
   
Comment:
   

Attached Files
file #39880:  build-failure added by prak56755 (21KiB - application/octet-stream)

 

Depends on the following items: None found

Items that depend on this one: None found

 

Carbon-Copy List
  • -email is unavailable- added by nachanon (Posted a comment)
  • -email is unavailable- added by rwp (Posted a comment)
  • -email is unavailable- added by prak56755 (Submitted the item)
  •  

    Do you think this task is very important?
    If so, you can add your encouragement to it.
    This task has 0 encouragements so far.

    Only logged-in users can vote.

     

     

     

    Follows 1 latest change.

    Date Changed by Updated Field Previous Value => Replaced by
    2017-03-02 rwp Reassign itemSavannah Administration, sr #109272 => Gnash - The GNU Flash player, bug #50434

    Back to the top


    Powered by Savane 3.5