bugGnash - The GNU Flash player - Bugs: bug #31984, build fails on Dragora linux


bug #31984: build fails on Dragora linux

Submitted by:  Gabriele Giacone <gg0>
Submitted on:  Sun 26 Dec 2010 11:06:11 PM UTC  
Category:  build Severity:  3 - Normal
Release:  master Status:  None
Privacy:  Public Assigned to:  None
Open/Closed:  Open

Add a New Comment (Rich Markup)

You are not logged in

Please log in, so followups can be emailed to you.


Sun 26 Dec 2010 11:06:11 PM UTC, original submission:  

Bug reporter from irc.
Attached full configure/make output.

./configure --disable-testsuite --enable-gui=gtk --enable-renderer=agg

Generating revno.h
make  all-recursive
make[1]: Entering directory `/tmp/sources/gnash-0.8.8'
Making all in libbase
make[2]: Entering directory `/tmp/sources/gnash-0.8.8/libbase'
  CC     libltdlc_la-ltdl.lo
/bin/sh: --silent: command not found
make[2]: *** [libltdlc_la-ltdl.lo] Error 127
make[2]: Leaving directory `/tmp/sources/gnash-0.8.8/libbase'
make[1]: *** [all-recursive] Error 1
make[1]: Leaving directory `/tmp/sources/gnash-0.8.8'
make: *** [all] Error 2

Gabriele Giacone <gg0>
Project Member


(Note: upload size limit is set to 16384 kB, after insertion of the required escape characters.)

Attach Files:

Attached Files
file #22292:  output.log added by gg0 (49KiB - text/x-log)


Depends on the following items: None found

Items that depend on this one: None found


Carbon-Copy List
  • -email is unavailable- added by gg0 (Submitted the item)

    Do you think this task is very important?
    If so, you can add your encouragement to it.
    This task has 0 encouragements so far.

    Only logged-in users can vote.




    Follows 1 latest change.

    Date Changed by Updated Field Previous Value => Replaced by
    2010-12-26 gg0 Attached File- => Added output.log, #22292

    Back to the top

    Powered by Savane 3.5