helpGNU VCDImager - Support: sr #103497, Cannot execute self-test \

 
 

sr #103497: Cannot execute self-test \

Submitted by:  Randy Olinger <rmolinger>
Submitted on:  Thu 21 Oct 2004 02:02:00 AM UTC  
 
Category: Bug ReportPriority: 5 - Normal
Severity: 3 - NormalStatus: Done
Privacy: PublicAssigned to: None
Open/Closed: OpenOperating System: None

Add a New Comment (Rich MarkupRich Markup):
   

You are not logged in

Please log in, so followups can be emailed to you.

 

Fri 12 Nov 2004 10:55:54 AM UTC, comment #1:

In fact, This is in the output you shoud get. The automake system should be expecting a failure here as this is a test of the "assert" macro.

The "bug" is probably some sort of sort of incompatibility between the OS system you are using and the checking mechanism which is part of GNU automake. I know for example cygwin doesn't handle expected failures properly.

Rocky Bernstein <rocky>
Project Administrator
Thu 21 Oct 2004 02:02:00 AM UTC, original submission:

See output of "make check" command in attached file. Fails assertion.

PASS: check_svcd1.sh
!ASSERT: file testassert.c: line 33 (main): should not be reached
XFAIL: testassert
=======================================
1 of 7 tests failed
Please report to -unavailable-
=======================================
make[2]: *** [check-TESTS] Error 1
make[2]: Leaving directory `/mnt/terrance/install/vcdimager-0.7.20/test'
make[1]: *** [check-am] Error 2
make[1]: Leaving directory `/mnt/terrance/install/vcdimager-0.7.20/test'
make: *** [check-recursive] Error 1

My system is a basic RedHat 9.

Randy Olinger <rmolinger>

 

(Note: upload size limit is set to 16384 kB, after insertion of the required escape characters.)

Attach File(s):
   
   
Comment:
   

Attached Files
file #3899:  check.out added by rmolinger (13kB - x-application/text - output of command "make check")

 

Depends on the following items: None found

Items that depend on this one: None found

 

CC list is empty

 

Do you think this task is very important?
If so, you can click here to add your encouragement to it.
This task has 0 encouragements so far.

Only logged-in users can vote.

 

Please enter the title of George Orwell's famous dystopian book (it's a date):

 

 

Follow 3 latest changes.

Date Changed By Updated Field Previous Value => Replaced By
Fri 12 Nov 2004 10:56:33 AM UTCrockySummaryCannot execute self-test "make check" successfully in version 0.7.20=>Cannot execute self-test \
Fri 12 Nov 2004 10:55:54 AM UTCrockyStatusNone=>Done
Thu 21 Oct 2004 02:02:00 AM UTCrmolingerAttached File-=>Added check.out, #78

Back to the top


Powered by Savane 3.1-cleanup