bugfindutils - Bugs: bug #29511, fails to build on kfreebsd-*

 
 

bug #29511: fails to build on kfreebsd-*

Submitted by:  Andreas Metzler <ametzler>
Submitted on:  Sat 10 Apr 2010 01:02:55 PM UTC  
 
Category:  find Severity:  3 - Normal
Item Group:  Compilation Failure Status:  Fixed
Privacy:  Public Assigned to:  James Youngman <jay>
Originator Name:  Open/Closed:  Closed
Release:  4.5.6b Fixed Release:  4.5.9

Add a New Comment (Rich Markup)
   

You are not logged in

Please log in, so followups can be emailed to you.

 

Mon 12 Apr 2010 11:51:22 PM UTC, comment #2: 

Fixed the in 4.5.x branch.

James Youngman <jay>
Project AdministratorIn charge of this item.
Sat 10 Apr 2010 11:05:23 PM UTC, comment #1: 

The attached patch should resolve the problem; I also emailed it to bug-findutils@gnu.org.

(file #20185)

James Youngman <jay>
Project AdministratorIn charge of this item.
Sat 10 Apr 2010 01:02:55 PM UTC, original submission:  

Starting with 4.5.6b (up to and including the latest release 4.5.8) findutils fails to build on kfreebsd-* with this error message:

gcc -std=gnu99 -DHAVE_CONFIG_H -I. -I.. -I../gnulib/lib -I../gnulib/lib   -Wdeclaration-after-statement -Wall -g -O2 -MT fdleak.o -MD -MP -MF .deps/fdleak.Tpo -c -o fdleak.o fdleak.c
fdleak.c: In function ‘get_max_fd’:
fdleak.c:125: error: ‘RLIM_SAVED_MAX’ undeclared (first use in this function)
fdleak.c:125: error: (Each undeclared identifier is reported only once
fdleak.c:125: error: for each function it appears in.)
fdleak.c:127: error: ‘RLIM_SAVED_CUR’ undeclared (first use in this function)
make[3]: *** [fdleak.o] Fehler 1
make[3]: Leaving directory `/tmp/FIND/findutils-4.5.6b/lib'
make[2]: *** [all] Fehler 2
make[2]: Leaving directory `/tmp/FIND/findutils-4.5.6b/lib'
make[1]: *** [all-recursive] Fehler 1
make[1]: Leaving directory `/tmp/FIND/findutils-4.5.6b'
make: *** [all] Fehler 2

See also http://bugs.debian.org/577131

Andreas Metzler <ametzler>

 

(Note: upload size limit is set to 16384 kB, after insertion of the required escape characters.)

Attach Files:
   
   
Comment:
   

 

Depends on the following items: None found

Items that depend on this one: None found

 

Carbon-Copy List
  • -email is unavailable- added by jay (Updated the item)
  •  

    Do you think this task is very important?
    If so, you can add your encouragement to it.
    This task has 0 encouragements so far.

    Only logged-in users can vote.

     

     

     

    Follow 8 latest changes.

    Date Changed by Updated Field Previous Value => Replaced by
    2011-05-11 jay Fixed Release4.5.10 => 4.5.9
    2011-05-11 jay Open/ClosedOpen => Closed
        Fixed ReleaseNone => 4.5.10
    2010-04-12 jay StatusCode Review => Fixed
    2010-04-10 jay Assigned toNone => jay
    2010-04-10 jay Attached File- => Added 0001-Fix-Savannah-bug-29511-fails-to-build-on-kfreebsd.patch, #20185
        StatusNone => Code Review
    2010-04-10 ametzler Carbon-CopyRemoved 20807 => -

    Back to the top


    Powered by Savane 3.5