buglibffcall - foreign function call libraries - Bugs: bug #22084, make check fails on...

 
 

bug #22084: make check fails on i686-apple-darwin8.8.1

Submitted by:  Sam Steingold <sds>
Submitted on:  Tue 22 Jan 2008 08:12:24 PM UTC  
 
Category: NoneSeverity: 3 - Normal
Item Group: portStatus: None
Privacy: PublicAssigned to: Bruno Haible <haible>
Open/Closed: Open

Add a New Comment (Rich MarkupRich Markup):
   

You are not logged in

Please log in, so followups can be emailed to you.

 

Tue 13 Jul 2010 05:54:48 PM UTC, comment #3:

The patch applies cleanly, but
I do not have access to an i686-apple-darwin machine.
Does libffcall pass all tests with this patch?

Sam Steingold <sds>
Project Administrator
Sat 16 Feb 2008 01:07:55 PM UTC, comment #2:

The patch from sourceforce is in the attachment as unified diff.
It fixes the problems a MacbookPro running Max OS X 10.4 and recently 10.5.
Please check validity.

(file #15050)

Christoph Mayer <hcab>
Tue 22 Jan 2008 08:19:23 PM UTC, comment #1:

there is a recent patch in
http://sourceforge.net/tracker/index.php?func=detail&aid=1535284&group_id=1355&atid=101355
which is a dupe for this one

Sam Steingold <sds>
Project Administrator
Tue 22 Jan 2008 08:12:24 PM UTC, original submission:

http://sourceforge.net/tracker/index.php?func=detail&aid=1628070&group_id=1355&atid=101355

Source/ffcall-1.10 druffer$ make check
cd avcall; make check
./minitests > minitests.out
LC_ALL=C uniq -u < minitests.out > minitests.output.i686-apple-darwin8.8.1
test '!' -s minitests.output.i686-apple-darwin8.8.1
cd vacall; make check
./minitests > minitests.out
LC_ALL=C uniq -u < minitests.out > minitests.output.i686-apple-darwin8.8.1
test '!' -s minitests.output.i686-apple-darwin8.8.1
cd trampoline; make check
./test1
Works, test1 passed.
./test2
test2 passed.
touch tests.passed.i686-apple-darwin8.8.1
cd callback; make check
cd vacall_r; make all
make[2]: Nothing to be done for `all'.
cd trampoline_r; make all
make[2]: Nothing to be done for `all'.
cd vacall_r; make check
make[2]: Nothing to be done for `check'.
cd trampoline_r; make check
./test1
make[2]: *** [check] Illegal instruction
make[1]: *** [check-subdirs] Error 2
make: *** [check] Error 2

Sam Steingold <sds>
Project Administrator

 

(Note: upload size limit is set to 16384 kB, after insertion of the required escape characters.)

Attach File(s):
   
   
Comment:
   

Attached Files
file #15050:  diff_apple_i386.txt added by hcab (4kB - text/plain)

 

Depends on the following items: None found

Items that depend on this one: None found

 

Carbon-Copy List
  • -unavailable- added by hcab (Updated the item)
  • -unavailable- added by druffer (Continuing monitor from sourceforge)
  • -unavailable- added by sds (Submitted the item)
  •  

    Do you think this task is very important?
    If so, you can click here to add your encouragement to it.
    This task has 0 encouragements so far.

    Only logged-in users can vote.

     

    Please enter the title of George Orwell's famous dystopian book (it's a date):

     

     

    Follow 3 latest changes.

    Date Changed By Updated Field Previous Value => Replaced By
    Tue 28 Apr 2009 05:43:39 PM UTCsdsItem GroupNone=>port
    Sat 16 Feb 2008 01:07:55 PM UTChcabAttached File-=>Added diff_apple_i386.txt, #15050
    Tue 22 Jan 2008 08:37:43 PM UTCdrufferCarbon-Copy-=>Added druffer

    Back to the top


    Powered by Savane 3.1-cleanup